Stream

Alexx Harper

Help compiling XOSP  - 
 
Is There XOSP for Xperia phones? Or not? 
1
Add a comment...

NIKHIL JAIN

Help compiling XOSP  - 
 
make: * No rule to make target '/home/skull/xosp/out/target/product/tomato/obj/STATIC_LIBRARIES/lib_driver_cmd_qcwcn_intermediates/export_includes', needed by '/home/skull/xosp/out/target/product/tomato/obj/EXECUTABLES/hostapd_intermediates/import_includes'. Stop. make: * Waiting for unfinished jobs....

Export includes file: frameworks/base/cmds/hid/jni/Android.mk -- /home/skull/xosp/out/target/product/tomato/obj/SHARED_LIBRARIES/libhidcommand_jni_intermediates/export_includes make: * No rule to make target '/home/skull/xosp/out/target/product/tomato/obj/STATIC_LIBRARIES/lib_driver_cmd_qcwcn_intermediates/export_includes', needed by '/home/skull/xosp/out/target/product/tomato/obj/EXECUTABLES/hostapd_intermediates/import_includes'. Stop. make: * Waiting for unfinished jobs.... Export includes file: external/libnl/Android.mk -- /home/skull/xosp/out/target/product/tomato/obj/SHARED_LIBRARIES/libnl_intermediates/export_includes
1
Amarjit Singh's profile photoNitinkumar Chobhe's profile photo
24 comments
 
+Amarjit Singh I don't know how to do that. I have no clues as to why it is boot looping; I do not have logs or device to look in to
Add a comment...

NIKHIL JAIN

Help compiling XOSP  - 
 
Install: /home/skull/XOSP/out/target/product/tomato/system/bin/dhcpcd
Install: /home/skull/XOSP/out/target/product/tomato/system/bin/dhcptool
target Executable: e2fsck (/home/skull/XOSP/out/target/product/tomato/obj/EXECUTABLES/e2fsck_intermediates/LINKED/e2fsck)
+/home/skull/XOSP/out/target/product/tomato/recovery.img maxsize=21356544 blocksize=135168 total=21774336 reserve=270336
error: +/home/skull/XOSP/out/target/product/tomato/recovery.img too large (21774336 > [21626880 - 270336])
build/core/Makefile:1034: recipe for target '/home/skull/XOSP/out/target/product/tomato/recovery.img' failed
make: * [/home/skull/XOSP/out/target/product/tomato/recovery.img] Error 1
make: * Deleting file '/home/skull/XOSP/out/target/product/tomato/recovery.img'
make: * Waiting for unfinished jobs....
  
3
Carlos Arriaga's profile photoDarshan Manjrekar's profile photo
3 comments
 
Remove limit for recovery size
Add a comment...

Stefano Trevisan

Help compiling XOSP  - 
 
Ok guys. Rom compiled ^^ Thanks for help.
Only a problem with camera :(
Video works but photo doesn't. Push buttom, make "click" but apparently don't save image.
Any idea?
1
Nitinkumar Chobhe's profile photoStefano Trevisan's profile photo
4 comments
 
lol ^^
Add a comment...

Pedro Kalil
moderator

Help compiling XOSP  - 
 
Thanks for everyone that helped me, the compiling process is running for 30minutes straight, dont think that is gonna fail.
2
Add a comment...

Pedro Kalil
moderator

Help compiling XOSP  - 
 
now this happens
root@pedro-virtual-machine:/home/pedro/android/system# brunch bacon
including vendor/xosp/vendorsetup.sh

============== Team XOSP presents ==============
========== XOSP for bacon ==============
PLATFORM_VERSION_CODENAME=REL
PLATFORM_VERSION=6.0.1
XOSP_MODVERSION=XOSP-6.2-UNOFFICIAL-20160619-bacon
XOSP_RELEASE =RL6
XOSP_REVISION =2
TARGET_PRODUCT=xosp_bacon
TARGET_BUILD_VARIANT=userdebug
TARGET_BUILD_TYPE=release
TARGET_BUILD_APPS=
TARGET_ARCH=arm
TARGET_ARCH_VARIANT=armv7-a-neon
TARGET_CPU_VARIANT=krait
TARGET_2ND_ARCH=
TARGET_2ND_ARCH_VARIANT=
TARGET_2ND_CPU_VARIANT=
HOST_ARCH=x86_64
HOST_OS=linux
HOST_OS_EXTRA=Linux-4.2.0-27-generic-x86_64-with-Ubuntu-14.04-trusty
HOST_BUILD_TYPE=release
BUILD_ID=MOB30M
OUT_DIR=/home/pedro/android/system/out
======================================================

============== Team XOSP presents ==============
========== XOSP for bacon ==============
PLATFORM_VERSION_CODENAME=REL
PLATFORM_VERSION=6.0.1
XOSP_MODVERSION=XOSP-6.2-UNOFFICIAL-20160619-bacon
XOSP_RELEASE =RL6
XOSP_REVISION =2
TARGET_PRODUCT=xosp_bacon
TARGET_BUILD_VARIANT=userdebug
TARGET_BUILD_TYPE=release
TARGET_BUILD_APPS=
TARGET_ARCH=arm
TARGET_ARCH_VARIANT=armv7-a-neon
TARGET_CPU_VARIANT=krait
TARGET_2ND_ARCH=
TARGET_2ND_ARCH_VARIANT=
TARGET_2ND_CPU_VARIANT=
HOST_ARCH=x86_64
HOST_OS=linux
HOST_OS_EXTRA=Linux-4.2.0-27-generic-x86_64-with-Ubuntu-14.04-trusty
HOST_BUILD_TYPE=release
BUILD_ID=MOB30M
OUT_DIR=/home/pedro/android/system/out
======================================================
make: Entering directory `/home/pedro/android/system'
build/core/binary.mk:37: libwifi-hal-qcom uses kernel headers, but does not depend on them!
build/core/binary.mk:37: libwifi-hal-qcom uses kernel headers, but does not depend on them!
find: `dummy': No such file or directory
build/core/Makefile:46: warning: overriding commands for target `/home/pedro/android/system/out/target/product/bacon/system/lib/soundfx/libeffectproxy.so'
build/core/base_rules.mk:559: warning: ignoring old commands for target `/home/pedro/android/system/out/target/product/bacon/system/lib/soundfx/libeffectproxy.so'
PRODUCT_COPY_FILES vendor/xosp/prebuilt/common/media/audio/ui/camera_click.ogg:system/media/audio/ui/camera_click.ogg ignored.
PRODUCT_COPY_FILES vendor/xosp/prebuilt/common/media/audio/ui/camera_focus.ogg:system/media/audio/ui/camera_focus.ogg ignored.
PRODUCT_COPY_FILES vendor/xosp/prebuilt/common/media/audio/ui/Dock.ogg:system/media/audio/ui/Dock.ogg ignored.
PRODUCT_COPY_FILES vendor/xosp/prebuilt/common/media/audio/ui/Effect_Tick.ogg:system/media/audio/ui/Effect_Tick.ogg ignored.
PRODUCT_COPY_FILES vendor/xosp/prebuilt/common/media/audio/ui/KeypressDelete.ogg:system/media/audio/ui/KeypressDelete.ogg ignored.
PRODUCT_COPY_FILES vendor/xosp/prebuilt/common/media/audio/ui/KeypressInvalid.ogg:system/media/audio/ui/KeypressInvalid.ogg ignored.
PRODUCT_COPY_FILES vendor/xosp/prebuilt/common/media/audio/ui/KeypressReturn.ogg:system/media/audio/ui/KeypressReturn.ogg ignored.
PRODUCT_COPY_FILES vendor/xosp/prebuilt/common/media/audio/ui/KeypressSpacebar.ogg:system/media/audio/ui/KeypressSpacebar.ogg ignored.
PRODUCT_COPY_FILES vendor/xosp/prebuilt/common/media/audio/ui/KeypressStandard.ogg:system/media/audio/ui/KeypressStandard.ogg ignored.
PRODUCT_COPY_FILES vendor/xosp/prebuilt/common/media/audio/ui/Lock.ogg:system/media/audio/ui/Lock.ogg ignored.
PRODUCT_COPY_FILES vendor/xosp/prebuilt/common/media/audio/ui/LowBattery.ogg:system/media/audio/ui/LowBattery.ogg ignored.
PRODUCT_COPY_FILES vendor/xosp/prebuilt/common/media/audio/ui/Trusted.ogg:system/media/audio/ui/Trusted.ogg ignored.
PRODUCT_COPY_FILES vendor/xosp/prebuilt/common/media/audio/ui/Undock.ogg:system/media/audio/ui/Undock.ogg ignored.
PRODUCT_COPY_FILES vendor/xosp/prebuilt/common/media/audio/ui/Unlock.ogg:system/media/audio/ui/Unlock.ogg ignored.
PRODUCT_COPY_FILES vendor/xosp/prebuilt/common/media/audio/ui/VideoRecord.ogg:system/media/audio/ui/VideoRecord.ogg ignored.
build/core/Makefile:46: warning: overriding commands for target `/home/pedro/android/system/out/target/product/bacon/system/app/Home/Home.apk'
build/core/base_rules.mk:559: warning: ignoring old commands for target `/home/pedro/android/system/out/target/product/bacon/system/app/Home/Home.apk'
No private recovery resources for TARGET_DEVICE bacon
build/core/tasks/kernel.mk:158: *************************************************************
build/core/tasks/kernel.mk:159: * Using prebuilt kernel binary instead of source              *
build/core/tasks/kernel.mk:160: * THIS IS DEPRECATED, AND WILL BE DISCONTINUED                *
build/core/tasks/kernel.mk:161: * Please configure your device to download the kernel         *
build/core/tasks/kernel.mk:162: * source repository to kernel/oneplus/msm8974
build/core/tasks/kernel.mk:163: * See http://wiki.cyanogenmod.org/w/Doc:_integrated_kernel_building build/core/tasks/kernel.mk:164: * for more information                                        *
build/core/tasks/kernel.mk:165: *************************************************************
host C: mkbootimg <= system/core/mkbootimg/mkbootimg.c
host StaticLib: libcompiler_rt-extras (/home/pedro/android/system/out/host/linux-x86/obj/STATIC_LIBRARIES/libcompiler_rt-extras_intermediates/libcompiler_rt-extras.a)
host C++: libc++_static <= external/libcxx/src/algorithm.cpp
host C++: libc++_static <= external/libcxx/src/bind.cpp
host C++: libc++_static <= external/libcxx/src/chrono.cpp
host C++: libc++_static <= external/libcxx/src/condition_variable.cpp
host C++: libc++_static <= external/libcxx/src/debug.cpp
host C++: libc++_static <= external/libcxx/src/exception.cpp
host C++: libc++_static <= external/libcxx/src/future.cpp
host C++: libc++_static <= external/libcxx/src/hash.cpp
host C++: libc++_static <= external/libcxx/src/ios.cpp
host C++: libc++_static <= external/libcxx/src/iostream.cpp
host C++: libc++_static <= external/libcxx/src/locale.cpp
host C++: libc++_static <= external/libcxx/src/memory.cpp
host C++: libc++_static <= external/libcxx/src/mutex.cpp
host C++: libc++_static <= external/libcxx/src/new.cpp
host C++: libc++_static <= external/libcxx/src/optional.cpp
host C++: libc++_static <= external/libcxx/src/random.cpp
host C++: libc++_static <= external/libcxx/src/regex.cpp
host C++: libc++_static <= external/libcxx/src/shared_mutex.cpp
host C++: libc++_static <= external/libcxx/src/stdexcept.cpp
host C++: libc++_static <= external/libcxx/src/string.cpp
host C++: libc++_static <= external/libcxx/src/strstream.cpp
host C++: libc++_static <= external/libcxx/src/system_error.cpp
host C++: libc++_static <= external/libcxx/src/thread.cpp
host C++: libc++_static <= external/libcxx/src/typeinfo.cpp
host C++: libc++_static <= external/libcxx/src/utility.cpp
host C++: libc++_static <= external/libcxx/src/valarray.cpp
host StaticLib: libc++abi (/home/pedro/android/system/out/host/linux-x86/obj/STATIC_LIBRARIES/libc++abi_intermediates/libc++abi.a)
host StaticLib: libmincrypt (/home/pedro/android/system/out/host/linux-x86/obj/STATIC_LIBRARIES/libmincrypt_intermediates/libmincrypt.a)
host C: acp <= build/tools/acp/acp.c
make: * No rule to make target `/home/pedro/android/system/out/target/product/bacon/kernel', needed by `/home/pedro/android/system/out/target/product/bacon/boot.img'.  Stop.
make: * Waiting for unfinished jobs....
host StaticLib: libhost (/home/pedro/android/system/out/host/linux-x86/obj/STATIC_LIBRARIES/libhost_intermediates/libhost.a)
make: Leaving directory `/home/pedro/android/system'

#### make failed to build some targets (57 seconds) ####

root@pedro-virtual-machine:/home/pedro/android/system#
Why does CM want the kernel built together with Android? Before CM9, we depended on having prebuilt kernels in every device repository. These were compiled separately from the framework and required the device maintainer to manually update the kernel image and modules any time a change is done.
1
Pedro Kalil's profile photo
8 comments
 
+Aaahh Ahh lol
Add a comment...

Pedro Kalil
moderator

Help compiling XOSP  - 
 
After i set everything up for bacon (by myself, instead of breakfast), and brunch bacon-userdebug, this happens.

including vendor/xosp/vendorsetup.sh
build/core/product_config.mk:234: * Can not locate config makefile for product "bacon".  Pare.
WARNING: Trying to fetch a device that's already there
WARNING: device/oneplus/bacon/xosp.dependencies file not found
build/core/product_config.mk:234: * Can not locate config makefile for product "bacon".  stop.

** Don't have a product spec for: 'bacon'
** Do you have the right repo manifest?
1
Jithu Mathew Joseph (Jithumon)'s profile photoAditya Wasan's profile photo
9 comments
Add a comment...

Pedro Kalil
moderator

Help compiling XOSP  - 
 
ok to fix i switched to a unofficial rom andextracted files. now this happens:


make: * No rule to make target `vendor/oneplus/bacon/proprietary/app/TimeService/TimeService.apk', needed by `/home/pedro/android/system/out/target/product/bacon/obj/APPS/TimeService_intermediates/package.apk'. Stop.
make: * Waiting for unfinished jobs....
make: Leaving directory `/home/pedro/android/system'
1
Pedro Kalil's profile photoAkhil Narang's profile photo
7 comments
 
Clone the repo into that dir
Add a comment...

Pedro Kalil
moderator

Help compiling XOSP  - 
 
im trying to compile to opo but i get this error

x_intermediates/toybox abandonada.
make: Dependência circular toybox <- /home/pedro/android/system/out/target/product/bacon/system/bin/toybox abandonada.
target StaticLib: libtoolbox_dd (/home/pedro/android/system/out/target/product/bacon/obj/STATIC_LIBRARIES/libtoolbox_dd_intermediates/libtoolbox_dd.a)
Install: /home/pedro/android/system/out/target/product/bacon/system/bin/uiautomator
target thumb C: vold <= system/vold/vold.c
target thumb C: libvold <= system/vold/cryptfs.c
target Prebuilt: wm (/home/pedro/android/system/out/target/product/bacon/obj/EXECUTABLES/wm_intermediates/wm)
target thumb C: wpa_cli <= external/wpa_supplicant_8/wpa_supplicant/wpa_cli.c
system/vold/cryptfs.c:71:10: fatal error: 'cryptfs_hw.h' file not found
#include "cryptfs_hw.h"
^
target thumb C: wpa_cli <= external/wpa_supplicant_8/wpa_supplicant/src/common/wpa_ctrl.c
1 error generated.
make: ** [/home/pedro/android/system/out/target/product/bacon/obj/STATIC_LIBRARIES/libvold_intermediates/cryptfs.o] Erro 1
make: ** Esperando que outros processos terminem.
make: Saindo do diretório `/home/pedro/android/system'

#### make failed to build some targets (18:16 (mm:ss)) ####


here is my full output

http://pastebin.com/0xng2Gfb
 ·  Translate
1
Nitinkumar Chobhe's profile photoPedro Kalil's profile photo
5 comments
Add a comment...

Quy Nguyen

Help compiling XOSP  - 
 
Hi
I'm trying to build XOSP for my f320 variant g2 phone, nad I'm encountering this error
http://www.hastebin.com/eribunucel.vhdl I've only successfully compiled RR before so any advice would be great :) thanks in adv
1
Nitinkumar Chobhe's profile photoQuy Nguyen's profile photo
10 comments
Add a comment...

mohamed tamer

Help compiling XOSP  - 
 
i want to build xosp for my asus ze500kl can any one help me
1
mohamed tamer's profile photo
9 comments
 
not ze500kl
Add a comment...

Ming Wy

Help compiling XOSP  - 
 
How can i fix this error

make: * No rule to make target `/home/**/xosp/out/target/product/libra/obj/STATIC_LIBRARIES/libinit_msm_intermediates/export_includes', needed by `/home/**/xosp/out/target/product/libra/obj/EXECUTABLES/init_intermediates/import_includes'. Stop.
1
Ming Wy's profile photoAkhil Narang's profile photo
6 comments
 
Yep, but does device tree has a call to build it probably
Add a comment...

NIKHIL JAIN

Help compiling XOSP  - 
 
error
Notice file: frameworks/base/packages/WAPPushManager/NOTICE -- /home/skull/XOSP/out/target/product/tomato/obj/NOTICE_FILES/src//system/app/WAPPushManager/WAPPushManager.apk.txt
Notice file: packages/apps/XOSPFileManager/NOTICE -- /home/skull/XOSP/out/target/product/tomato/obj/NOTICE_FILES/src//system/app/XOSPFileManager/XOSPFileManager.apk.txt
/bin/bash: mvn: command not found
vendor/xosp/build/core/maven_artifact.mk:42: recipe for target '/home/skull/XOSP/out/target/common/obj/JAVA_LIBRARIES/ambientsdk_intermediates/com.cyngn.ambient.ambientsdk-1.5.11.aar' failed
make: * [/home/skull/XOSP/out/target/common/obj/JAVA_LIBRARIES/ambientsdk_intermediates/com.cyngn.ambient.ambientsdk-1.5.11.aar] Error 127
make: * Waiting for unfinished jobs....
make: Leaving directory '/home/skull/XOSP'

#### make failed to build some targets (09:12 (mm:ss)) ####
2
Akhil Narang's profile photoCălin Neamţu's profile photo
2 comments
 
You're missing Maven. Install it and try to compile again
Add a comment...

Stefano Trevisan

Help compiling XOSP  - 
 
Hi, i try to compile for d802 but i have this problem:

fatal: duplicate path kernel/lge/msm8974 in /home/android/cm13/.repo/manifest.xml
doesn't found in manifest so why duplicate?

my local_manifest is this:
<?xml version="1.0" encoding="UTF-8"?>
<manifest>
<remote name="github" fetch="git://github.com" />
<project name="TheMuppets/proprietary_vendor_lge" path="vendor/lge/" remote="github" revision="cm-13.0" />
<project name="CyanogenMod/android_kernel_lge_msm8974" path="kernel/lge/msm8974" remote="github" revision="cm-13.0" />
<project name="CyanogenMod/android_device_lge_d802" path="device/lge/d802" remote="github" revision="cm-13.0" />
<project name="CyanogenMod/android_device_lge_g2-common" path="device/lge/g2-common" remote="github" revision="cm-13.0" />
<project name="CyanogenMod/android_device_qcom_common" path="device/qcom/common" remote="github" revision="cm-13.0" />
<project name="CyanogenMod/android_device_qcom_sepolicy" path="device/qcom/sepolicy" remote="github" revision="cm-13.0" />
</manifest>
1
Stefano Trevisan's profile photo
19 comments
 
now this error:
android@builduntuvm:~/xosp$ export USE_CCACHE=1
android@builduntuvm:~/xosp$ prebuilts/misc/linux-x86/ccache/ccache -M 50G
Set cache size limit to 50.0 Gbytes
android@builduntuvm:~/xosp$ source build/./envsetup.sh
including vendor/xosp/vendorsetup.sh
including sdk/bash_completion/adb.bash
including vendor/xosp/bash_completion/git.bash
including vendor/xosp/bash_completion/repo.bash

android@builduntuvm:~/xosp$ brunch d802
including vendor/xosp/vendorsetup.sh
build/core/product_config.mk:253: * No matches for product "xosp_d802". Stop.
WARNING: Trying to fetch a device that's already there
WARNING: device/lge/d802/xosp.dependencies file not found
build/core/product_config.mk:253: * No matches for product "xosp_d802". Stop.

** Don't have a product spec for: 'xosp_d802'
** Do you have the right repo manifest?

No such item in brunch menu. Try 'breakfast'
Add a comment...

Pedro Kalil
moderator

Help compiling XOSP  - 
 
So , my mistake was that i was lazy asf to make my local manifest , so i used sultanxda's one , that obviously f*cked everything, so i deleted my entire project folder and diz this local manifest , and i added the muppets (lazy to make a new paste). http://pastebin.com/HTG898Fm
1
Add a comment...

Pedro Kalil
moderator

Help compiling XOSP  - 
 
progress has been made, now it starts building and shows this
 make: * No rule to make target `kernel/oneplus/msm8974/arch/arm/configs/cyanogenmod_bacon_defconfig', needed by `/home/pedro/android/system/out/target/product/bacon/obj/KERNEL_OBJ/.config'.  Stop.
make: * Waiting for unfinished jobs....
1
Jithu Mathew Joseph (Jithumon)'s profile photoPedro Kalil's profile photo
4 comments
 
ok im gonna finish the sync and try again
Add a comment...

Joel Maxuel

Help compiling XOSP  - 
 
Running into a build error:
frameworks/opt/telephony/src/java/com/android/internal/telephony/gsm/GsmServiceStateTracker.java:1629: error: cannot find symbol
                Settings.System.MVNO_ROAMING, 0) == 1;
                               ^
  symbol:   variable MVNO_ROAMING
  location: class System
Note: Some input files use or override a deprecated API.
Note: Recompile with -Xlint:deprecation for details.
Note: Some input files use unchecked or unsafe operations.
Note: Recompile with -Xlint:unchecked for details.
1 error
build/core/java.mk:394: recipe for target '/home/android/xosp/out/target/common/obj/JAVA_LIBRARIES/telephony-common_intermediates/classes-full-debug.jar' failed
make: * [/home/android/xosp/out/target/common/obj/JAVA_LIBRARIES/telephony-common_intermediates/classes-full-debug.jar] Error 41
make: * Waiting for unfinished jobs....
patch   1 is 1861895 bytes (of 973061)
patch   2 is 154 bytes (of 1777)
chunk   0: normal   (         0,    5943306)         210
chunk   1: deflate  (   5943306,    3526373)     1861895  (null)
chunk   2: normal   (   9469679,        273)         154

#### make failed to build some targets (01:22:37 (hh:mm:ss)) ####

android@cybaryme:~/xosp$

Upon investigation, this is a symbol that temasek (which recently got added into the manifest for this project) uses that CM does not.

I will use a local manifest to flip them back if a fresh sync does not help (may have just been caught in between changes).
1
Nitinkumar Chobhe's profile photoJoel Maxuel's profile photo
3 comments
 
Ah. i see now. Thanks.
Add a comment...

Pedro Kalil
moderator

Help compiling XOSP  - 
 
i synced the repo and this still happens :
target thumb C: libvold <= system/vold/cryptfs.c
system/vold/cryptfs.c:71:10: fatal error: 'cryptfs_hw.h' file not found
#include "cryptfs_hw.h"
^
1 error generated.
make: * [/home/pedro/android/system/out/target/product/bacon/obj/STATIC_LIBRARIES/libvold_intermediates/cryptfs.o] Error 1
make: * Waiting for unfinished jobs....
make: Leaving directory `/home/pedro/android/system'

#### make failed to build some targets (06:11 (mm:ss)) ####

full log

http://pastebin.com/yDnfysWa
1
Sai Vishal's profile photoPedro Kalil's profile photo
2 comments
 
+Sai Vishal I added qcom common
Add a comment...

Pedro Kalil
moderator

Help compiling XOSP  - 
 
hey im compiling the rom for opo and faced this :
host Executable: checkseapp (/home/pedro/android/system/out/host/linux-x86/obj/EXECUTABLES/checkseapp_intermediates/checkseapp)
Target buildinfo: /home/pedro/android/system/out/target/product/bacon/root/default.prop
host C: minigzip <= external/zlib/src/test/minigzip.c
1 warning generated.
make: * Sem regra para processar o alvo `/home/pedro/android/system/out/host/linux-x86/bin/dtbToolCM', necessário por `/home/pedro/android/system/out/target/product/bacon/dt.img'. Pare.
make: ** Esperando que outros processos terminem.
host StaticLib: libz (/home/pedro/android/system/out/host/linux-x86/obj/STATIC_LIBRARIES/libz_intermediates/libz.a)
make: Saindo do diretório `/home/pedro/android/system'

#### make failed to build some targets (01:48 (mm:ss)) ####

so i read on the internet that merging this fix
https://github.com/CyanogenMod/android_device_qcom_common.git

but it fail on merging and show this:

pedro@pedro-virtual-machine:~/android/system$ repo init -u https://github.com/CyanogenMod/android_device_qcom_common.git
fatal: Couldn't find remote ref refs/heads/xosp-mm
Unexpected end of command stream

the same happens on another folder
pedro@pedro-virtual-machine:~/android/lol$ repo init -u https://github.com/CyanogenMod/android_device_qcom_common.git
Get https://gerrit.googlesource.com/git-repo/clone.bundle
Get https://gerrit.googlesource.com/git-repo
Get https://github.com/CyanogenMod/android_device_qcom_common.git
% Total % Received % Xferd Average Speed Time Time Time Current
Dload Upload Total Spent Left Speed
0 0 0 0 0 0 0 0 --:--:-- --:--:-- --:--:-- 0
curl: (22) The requested URL returned error: 404 Not Found
Server does not provide clone.bundle; ignoring.
fatal: Couldn't find remote ref refs/heads/master
Unexpected end of command stream

. how can i fix it? .
here is my complete log
http://pastebin.com/QVw0s1dZ
 ·  Translate
1
Ronald Neuberger's profile photoPedro Kalil's profile photo
6 comments
 
+Ronald Neuberger add the muppets vendor, device, kernel, and oppo common to local manifest
Add a comment...

Ivan C.

Help compiling XOSP  - 
 
NEW POST: situation changed :)
After a bit of researches and and a massive help from Matteo Lima I did every possible step for building the ROM. But at the end I had this problem: http://www.hastebin.com/aqaxocuhos.hs
Could anybody help? I'm really at the end and everything is setted up, but I don't know how to solve
1
Nitinkumar Chobhe's profile photo
 
The error says:
"device/samsung/msm8974-common/msm8974.mk" does not exist

So that is the reason :|
Add a comment...