Profile

Cover photo
Jagadeesan PD
Attended Madras Institute of Technology, Chromepet, Chennai, India
Lives in Chennai
303,744 views
AboutPostsPhotosVideos

Stream

Jagadeesan PD

Discussion  - 
 
I am trying to build BenzoROM and I get this error.  Can someone help to correct this issue?  I have tried both with the TC included and built by me.  I get the same error.

==============
CC      drivers/thermal/intelli/msm_thermal.o
Assembler messages:
Fatal error: can't create drivers/thermal/intelli/.tmp_msm_thermal.o:

No such file or directory
make[4]: * [drivers/thermal/intelli/msm_thermal.o] Error 2
make[3]: * [drivers/thermal] Error 2
make[2]: * [drivers] Error 2
make[1]: * [sub-make] Error 2
make[1]: Leaving directory `/home/jenkins/BenzoROM/kernel/moto/shamu'
make: * [TARGET_KERNEL_BINARIES] Error 2

#### make failed to build some targets (14:46 (mm:ss)) ####
1
Jason Edson's profile photo
 
Maybe just make the path with mkdir? I don't know. I've never seen that error.
Add a comment...

Jagadeesan PD

Flaunt your Screens  - 
 
Blisspop 3.5 for Find 7.

Thank you +Patrick Graber​
2
Tuna AYHAN's profile photo
 
God blisspop you.
Add a comment...

Jagadeesan PD

Discussion Area  - 
 
Can someone post their roomservice.xml file for building BlissPop for Bacon?
Thanks
1
Jagadeesan PD's profile photo
 
+greg kobey Can you please help?
Add a comment...

Jagadeesan PD

Discussion Area  - 
 
I am trying to build for Bacon.

I get the below error.  Can some one help?
  Using /home/jagadees/bliss/kernel/oneplus/msm8974 as source for kernel
  CC      scripts/mod/empty.o
ccache: FATAL: Could not find compiler "arm-eabi-gcc" in PATH
/home/jagadees/bliss/kernel/oneplus/msm8974/scripts/Makefile.build:307: recipe for target 'scripts/mod/empty.o' failed
make[4]: * [scripts/mod/empty.o] Error 1
/home/jagadees/bliss/kernel/oneplus/msm8974/scripts/Makefile.build:443: recipe for target 'scripts/mod' failed
make[3]: * [scripts/mod] Error 2
/home/jagadees/bliss/kernel/oneplus/msm8974/Makefile:510: recipe for target 'scripts' failed
make[2]: * [scripts] Error 2
Makefile:130: recipe for target 'sub-make' failed
make[1]: * [sub-make] Error 2
make[1]: Leaving directory '/home/jagadees/bliss/kernel/oneplus/msm8974'
build/core/tasks/kernel.mk:218: recipe for target 'TARGET_KERNEL_BINARIES' failed
make: * [TARGET_KERNEL_BINARIES] Error 2
make: * Waiting for unfinished jobs....

Here is my roomservice.xml

<manifest>

  <project name="TeamBliss-Devices/android_device_oneplus_bacon" path="device/oneplus/bacon" remote="github" revision="lp5.0" />
  <project name="android_device_oppo_msm8974-common" path="device/oppo/msm8974-common" remote="TeamBliss-Devices" revision="lp5.0" />


<project name="CyanogenMod/android_device_oppo_common" path="device/oppo/common" remote="github" />
<project name="CyanogenMod/android_device_qcom_common" path="device/qcom/common" remote="github" />
<project name="CyanogenMod/android_kernel_oneplus_msm8974" path="kernel/oneplus/msm8974" remote="github" />


<project name="CyanogenMod/android_hardware_qcom_audio" path="hardware/qcom/audio-caf/default" remote="github" revision="cm-12.0-caf-8974" />

<project name="TheMuppets/proprietary_vendor_oneplus.git" path="vendor/oneplus" remote="github" revision="cm-12.0"/>
<project name="TheMuppets/proprietary_vendor_oppo.git" path="vendor/oppo" remote="github" revision="cm-12.0"/>
</manifest>
1
Jagadeesan PD's profile photoSnehith Reddy's profile photo
15 comments
 
Pm on hangouts.
Add a comment...

Jagadeesan PD

Community Builds  - 
 
Anyone has a RRO build for One plus?
2
Add a comment...
In his circles
174 people

Jagadeesan PD

Releases (DO NOT POST)  - 
 
Find official Oppo Find7 builds here.
index - powered by h5ai 0.26.1+136~08cd031 (http://larsjung.de/h5ai/)
1
Alessandro Pisano's profile photo
 
Great!! ROM supporting LVM storage ?
Add a comment...

Jagadeesan PD

Ask A Question?  - 
 
Is there any instructions on how to add layers support to a CM TE supported ROM?
1
Jagadeesan PD's profile photoJamie Gowans's profile photoJonathan -DILLIGAF- Zuniga's profile photo
7 comments
 
To add on to what +Jamie Gowans​ is saying:
7) Never look at another ROM or forever be shunned.
Add a comment...

Jagadeesan PD

Validus - Bugs/ Problems  - 
 
fatal: Not a git repository: '/home/jenkins/Validus50/.repo/projects/external/ant-glob.git'
fatal: Not a git repository: '/home/jenkins/Validus50/.repo/projects/external/antlr.git'
fatal: Not a git repository: '/home/jenkins/Validus50/.repo/projects/frameworks/mff.git'
fatal: Not a git repository: '/home/jenkins/Validus50/.repo/projects/external/dnsmasq.git'
fatal: Not a git repository: '/home/jenkins/Validus50/.repo/projects/external/libnl.git'
fatal: Not a git repository: '/home/jenkins/Validus50/.repo/projects/external/qemu-pc-bios.git'
fatal: Not a git repository: '/home/jenkins/Validus50/.repo/projects/external/bsdiff.git'
fatal: Not a git repository: '/home/jenkins/Validus50/.repo/projects/external/jemalloc.git'
fatal: Not a git repository: '/home/jenkins/Validus50/.repo/projects/external/ant-glob.git'
fatal: Not a git repository: '/home/jenkins/Validus50/.repo/projects/external/bsdiff.git'
fatal: Not a git repository: '/home/jenkins/Validus50/.repo/projects/frameworks/mff.git'
fatal: Not a git repository: '/home/jenkins/Validus50/.repo/projects/external/qemu-pc-bios.git'
fatal: Not a git repository: '/home/jenkins/Validus50/.repo/projects/external/jemalloc.git'
fatal: Not a git repository: '/home/jenkins/Validus50/.repo/projects/external/antlr.git'
fatal: Not a git repository: '/home/jenkins/Validus50/.repo/projects/external/dnsmasq.git'
fatal: Not a git repository: '/home/jenkins/Validus50/.repo/projects/external/libnl.git'
error: Cannot fetch CyanogenMod/android_external_ant-glob
Fetching project packages_apps_Mms
fatal: Not a git repository: '/home/jenkins/Validus50/.repo/projects/packages/apps/Mms.git'
error: Cannot fetch platform/external/qemu-pc-bios
error: Cannot fetch platform/external/jemalloc
error: Cannot fetch CyanogenMod/android_frameworks_mff
error: Cannot fetch platform/external/libnl
error: Cannot fetch platform/external/bsdiff
error: Cannot fetch platform/external/antlr
error: Cannot fetch CyanogenMod/android_external_dnsmasq
fatal: Not a git repository: '/home/jenkins/Validus50/.repo/projects/packages/apps/Mms.git'
error: Cannot fetch packages_apps_Mms

error: Exited sync due to fetch errors

Unable to sync.  Can some one help?
1
Martin Coulon (Martinusbe)'s profile photoJagadeesan PD's profile photoJacques's profile photo
6 comments
Jacques
 
wich device where you trying?
Add a comment...

Jagadeesan PD

Questions  - 
 
I was trying to build RR 5.4.1 for Bacon.  The build is successful.  However, the boot always gets stuck at 1+ logo.  Am I missing something?  Any help?

Edit:  The vendor files are missing.  just added them.  will try rebuild
1
Add a comment...

Jagadeesan PD

Bug Reports  - 
 
I still have issues with my bacon build.

Today, I  built after repo sync, I have boot loop.  Can some one help?

Also, may I know the maintainer for bacon so that I can try to ping him?
1
1
Lenz Wagner's profile photoJagadeesan PD's profile photoIan Jago's profile photoHai Nguyen's profile photo
12 comments
 
tobitege is the bacon man.
Add a comment...

Jagadeesan PD

Bug Reports  - 
 
Anyone has camera issue ?

When opened camera app, get error that it is in use by another app. And then when exited, get systemui FC.

7th Mar build, Bacon.
1
Snehith Reddy's profile photoJagadeesan PD's profile photoVishnhav Ashok's profile photo
4 comments
 
Try Google camera,
Clear data from open camera and reboot and try again. 
Add a comment...

Jagadeesan PD

General Discussion  - 
 
Since this morning, I get this error when I try to build the ROM.  It used to work fine till yesterday.  Can anyone help to fix this ? +Aldrin Holmes

frameworks/base/services/core/java/com/android/server/pm/PackageManagerService.java:3104: error: cannot find symbol
            cachedPreLaunchCheckPackagesReplaced = mPreLaunchCheckPackagesReplaced;
                                                   ^
  symbol:   variable mPreLaunchCheckPackagesReplaced
  location: class PackageManagerService
frameworks/base/services/core/java/com/android/server/pm/PackageManagerService.java:3105: error: cannot find symbol
            cachedPreLaunchCheckResolveInfo = new ResolveInfo(mPreLaunchCheckResolveInfo);
                                                              ^
  symbol:   variable mPreLaunchCheckResolveInfo
  location: class PackageManagerService
frameworks/base/services/core/java/com/android/server/pm/PackageManagerService.java:3116: error: cannot find symbol
        if (!mPreLaunchCheckPackages.contains(packageName)) {
             ^
  symbol:   variable mPreLaunchCheckPackages
  location: class PackageManagerService
frameworks/base/services/core/java/com/android/server/pm/PackageManagerService.java:5411: error: cannot find symbol
        if (mCustomPreLaunchComponentName != null &&
            ^
  symbol:   variable mCustomPreLaunchComponentName
  location: class PackageManagerService
frameworks/base/services/core/java/com/android/server/pm/PackageManagerService.java:5412: error: cannot find symbol
                pkg.packageName.equals(mCustomPreLaunchComponentName.getPackageName())) {
                                       ^
  symbol:   variable mCustomPreLaunchComponentName
  location: class PackageManagerService
frameworks/base/services/core/java/com/android/server/pm/PackageManagerService.java:6678: error: cannot find symbol
            mPreLaunchCheckPackagesReplaced = true;
            ^
  symbol:   variable mPreLaunchCheckPackagesReplaced
  location: class PackageManagerService
frameworks/base/services/core/java/com/android/server/pm/PackageManagerService.java:6682: error: cannot find symbol
            preLaunchCheckActivity.name = mCustomPreLaunchComponentName.getClassName();
                                          ^
  symbol:   variable mCustomPreLaunchComponentName
  location: class PackageManagerService
frameworks/base/services/core/java/com/android/server/pm/PackageManagerService.java:6692: error: cannot find symbol
            mPreLaunchCheckResolveInfo.activityInfo = preLaunchCheckActivity;
            ^
  symbol:   variable mPreLaunchCheckResolveInfo
  location: class PackageManagerService
frameworks/base/services/core/java/com/android/server/pm/PackageManagerService.java:6693: error: cannot find symbol
            mPreLaunchCheckResolveInfo.priority = 0;
            ^
  symbol:   variable mPreLaunchCheckResolveInfo
  location: class PackageManagerService
frameworks/base/services/core/java/com/android/server/pm/PackageManagerService.java:6694: error: cannot find symbol
            mPreLaunchCheckResolveInfo.preferredOrder = 0;
            ^
  symbol:   variable mPreLaunchCheckResolveInfo
  location: class PackageManagerService
frameworks/base/services/core/java/com/android/server/pm/PackageManagerService.java:6695: error: cannot find symbol
            mPreLaunchCheckResolveInfo.match = 0;
            ^
  symbol:   variable mPreLaunchCheckResolveInfo
  location: class PackageManagerService
frameworks/base/services/core/java/com/android/server/pm/PackageManagerService.java:6698: error: cannot find symbol
                    mCustomPreLaunchComponentName);
                    ^
  symbol:   variable mCustomPreLaunchComponentName
  location: class PackageManagerService
frameworks/base/services/core/java/com/android/server/pm/PackageManagerService.java:13588: error: cannot find symbol
            mCustomPreLaunchComponentName = componentName;
            ^
  symbol:   variable mCustomPreLaunchComponentName
  location: class PackageManagerService
frameworks/base/services/core/java/com/android/server/pm/PackageManagerService.java:13597: error: cannot find symbol
                mPreLaunchCheckPackagesReplaced = false;
                ^
  symbol:   variable mPreLaunchCheckPackagesReplaced
  location: class PackageManagerService
frameworks/base/services/core/java/com/android/server/pm/PackageManagerService.java:13616: error: cannot find symbol
        mPreLaunchCheckPackages.add(packageName);
        ^
  symbol:   variable mPreLaunchCheckPackages
  location: class PackageManagerService
frameworks/base/services/core/java/com/android/server/pm/PackageManagerService.java:13623: error: cannot find symbol
        mPreLaunchCheckPackages.remove(packageName);
        ^
  symbol:   variable mPreLaunchCheckPackages
  location: class PackageManagerService
frameworks/base/services/core/java/com/android/server/pm/PackageManagerService.java:13631: error: cannot find symbol
        mPreLaunchCheckPackages.clear();
        ^
  symbol:   variable mPreLaunchCheckPackages
  location: class PackageManagerService
Note: Some input files use or override a deprecated API.
Note: Recompile with -Xlint:deprecation for details.
Note: Some input files use unchecked or unsafe operations.
Note: Recompile with -Xlint:unchecked for details.
17 errors
make: * [out/target/common/obj/JAVA_LIBRARIES/services.core_intermediates/classes-full-debug.jar] Error 41
make: * Waiting for unfinished jobs....
1
Aldrin Holmes (CallMeAldy)'s profile photoJakob Nixdorf's profile photoCurtis Beck's profile photoMichael Banks's profile photo
7 comments
 
Fixed. I removed those commits. I shouldn't have added them. lol. Didn't see a real need for them
Add a comment...
People
In his circles
174 people
Places
Map of the places this user has livedMap of the places this user has livedMap of the places this user has lived
Currently
Chennai
Links
Education
  • Madras Institute of Technology, Chromepet, Chennai, India
    B. Tech (Electonics Engineering), 1987 - 1990
Basic Information
Gender
Male
Apps with Google+ Sign-in
  • Hungry Shark Evolution
  • Hay Day
  • Hill Climb Racing
  • Flight Pilot Simulator 3D Free
  • Asphalt 8:Airborne